Reaction Details
TargetNitric oxide synthase, endothelial
LigandBDBM50115131
Substrate/Competitorn/a
Meas. Tech.ChEMBL_306644 (CHEMBL832981)
IC50 31710±n/a nM
Citation Matter, HKumar, HSFedorov, RFrey, AKotsonis, PHartmann, EFröhlich, LGReif, APfleiderer, WScheurer, PGhosh, DKSchlichting, ISchmidt, HH Structural analysis of isoform-specific inhibitors targeting the tetrahydrobiopterin binding site of human nitric oxide synthases. J Med Chem48:4783-92 (2005) 
 
Nitric oxide synthase, endothelial
Name:Nitric oxide synthase, endothelial
Type:Enzyme Catalytic Domain
Mol. Mass.:133297.84
Organism:Homo sapiens (Human)
Description:P29474
Residue:1203
BDBM50115131
NameBDBM50115131
Synonyms:6-(4-Chloro-phenyl)-N*4*-cyclohexylmethyl-5,6,7,8-tetrahydro-pteridine-2,4-diamine | CHEMBL98547
TypeSmall organic molecule
Emp. Form.C19H25ClN6
Mol. Mass.372.895
SMILESNc1nc(NCC2CCCCC2)c2NC(CNc2n1)c1ccc(Cl)cc1