Reaction Details
TargetNitric oxide synthase, inducible
LigandBDBM50115155
Substrate/Competitorn/a
Meas. Tech.ChEMBL_306628 (CHEMBL829930)
IC50 37440.0±n/a nM
Citation Matter, HKumar, HSFedorov, RFrey, AKotsonis, PHartmann, EFröhlich, LGReif, APfleiderer, WScheurer, PGhosh, DKSchlichting, ISchmidt, HH Structural analysis of isoform-specific inhibitors targeting the tetrahydrobiopterin binding site of human nitric oxide synthases. J Med Chem48:4783-92 (2005) 
 
Nitric oxide synthase, inducible
Name:Nitric oxide synthase, inducible
Type:Homodimer
Mol. Mass.:131141.95
Organism:Homo sapiens (Human)
Description:P35228
Residue:1153
BDBM50115155
NameBDBM50115155
Synonyms:7-Amino-3,3a,4,5-tetrahydro-8H-2-oxa-5,6,8,9b-tetraaza-cyclopenta[a]naphthalene-1,9-dione | CHEMBL101885
TypeSmall organic molecule
Emp. Form.C8H9N5O3
Mol. Mass.223.1888
SMILESNc1nc2NCC3COC(=O)N3c2c(=O)[nH]1