Reaction Details
TargetNitric oxide synthase, endothelial
LigandBDBM50170718
Substrate/Competitorn/a
Meas. Tech.ChEMBL_306644 (CHEMBL832981)
IC50 48140.0±n/a nM
Citation Matter, HKumar, HSFedorov, RFrey, AKotsonis, PHartmann, EFröhlich, LGReif, APfleiderer, WScheurer, PGhosh, DKSchlichting, ISchmidt, HH Structural analysis of isoform-specific inhibitors targeting the tetrahydrobiopterin binding site of human nitric oxide synthases. J Med Chem48:4783-92 (2005) 
 
Nitric oxide synthase, endothelial
Name:Nitric oxide synthase, endothelial
Type:Enzyme Catalytic Domain
Mol. Mass.:133297.84
Organism:Homo sapiens (Human)
Description:P29474
Residue:1203
BDBM50170718
NameBDBM50170718
Synonyms:6-Phenyl-N*4*,N*4*-dipropyl-5,6,7,8-tetrahydro-pteridine-2,4-diamine | CHEMBL185766
TypeSmall organic molecule
Emp. Form.C18H26N6
Mol. Mass.326.4392
SMILESCCCN(CCC)c1nc(N)nc2NCC(Nc12)c1ccccc1