Reaction Details
TargetNitric oxide synthase, brain
LigandBDBM50115159
Substrate/Competitorn/a
Meas. Tech.ChEMBL_306605 (CHEMBL833495)
IC50 13970±n/a nM
Citation Matter, HKumar, HSFedorov, RFrey, AKotsonis, PHartmann, EFröhlich, LGReif, APfleiderer, WScheurer, PGhosh, DKSchlichting, ISchmidt, HH Structural analysis of isoform-specific inhibitors targeting the tetrahydrobiopterin binding site of human nitric oxide synthases. J Med Chem48:4783-92 (2005) 
 
Nitric oxide synthase, brain
Name:Nitric oxide synthase, brain
Type:Homodimer
Mol. Mass.:160985.98
Organism:Homo sapiens (Human)
Description:P29475
Residue:1434
BDBM50115159
NameBDBM50115159
Synonyms:6-(4-Chloro-phenyl)-N*4*,N*4*-diethyl-5,6,7,8-tetrahydro-pteridine-2,4-diamine | CHEMBL319722
TypeSmall organic molecule
Emp. Form.C16H21ClN6
Mol. Mass.332.831
SMILESCCN(CC)c1nc(N)nc2NCC(Nc12)c1ccc(Cl)cc1