Reaction Details
TargetAdenosine receptor A2a
LigandBDBM50170816
Substrate/Competitorn/a
Meas. Tech.ChEMBL_303486 (CHEMBL838860)
Ki 16000±n/a nM
Citation Perreira, MJiang, JKKlutz, AMGao, ZGShainberg, ALu, CThomas, CJJacobson, KA "Reversine" and its 2-substituted adenine derivatives as potent and selective A3 adenosine receptor antagonists. J Med Chem48:4910-8 (2005) 
 
Adenosine receptor A2a
Name:Adenosine receptor A2a
Type:G Protein-Coupled Receptor (GPCR)
Mol. Mass.:44716.46
Organism:Homo sapiens (Human)
Description:P29274
Residue:412
BDBM50170816
NameBDBM50170816
Synonyms:CHEMBL363419 | Cyclohexyl-(2-phenoxy-9H-purin-6-yl)-amine
TypeSmall organic molecule
Emp. Form.C17H19N5O
Mol. Mass.309.3657
SMILESC1CCC(CC1)Nc1nc(Oc2ccccc2)nc2nc[nH]c12