Reaction Details
TargetAdenosine receptor A3
LigandBDBM50170826
Substrate/Competitorn/a
Meas. Tech.ChEMBL_303319 (CHEMBL840044)
Ki 960±n/a nM
Citation Perreira, MJiang, JKKlutz, AMGao, ZGShainberg, ALu, CThomas, CJJacobson, KA "Reversine" and its 2-substituted adenine derivatives as potent and selective A3 adenosine receptor antagonists. J Med Chem48:4910-8 (2005) 
 
Adenosine receptor A3
Name:Adenosine receptor A3
Type:G Protein-Coupled Receptor (GPCR)
Mol. Mass.:36197.32
Organism:Homo sapiens (Human)
Description:P0DMS8
Residue:318
BDBM50170826
NameBDBM50170826
Synonyms:CHEMBL188958 | N*6*-Cycloheptyl-9-methyl-N*2*-phenyl-9H-purine-2,6-diamine
TypeSmall organic molecule
Emp. Form.C19H24N6
Mol. Mass.336.4341
SMILESCn1cnc2c(NC3CCCCCC3)nc(Nc3ccccc3)nc12