Reaction Details
TargetAdenosine receptor A3
LigandBDBM50170829
Substrate/Competitorn/a
Meas. Tech.ChEMBL_303319 (CHEMBL840044)
Ki 1530±n/a nM
Citation Perreira, MJiang, JKKlutz, AMGao, ZGShainberg, ALu, CThomas, CJJacobson, KA "Reversine" and its 2-substituted adenine derivatives as potent and selective A3 adenosine receptor antagonists. J Med Chem48:4910-8 (2005) 
 
Adenosine receptor A3
Name:Adenosine receptor A3
Type:G Protein-Coupled Receptor (GPCR)
Mol. Mass.:36197.32
Organism:Homo sapiens (Human)
Description:P0DMS8
Residue:318
BDBM50170829
NameBDBM50170829
Synonyms:CHEMBL188541 | N*6*-Ethyl-N*2*-(4-morpholin-4-yl-phenyl)-9H-purine-2,6-diamine
TypeSmall organic molecule
Emp. Form.C17H21N7O
Mol. Mass.339.3949
SMILESCCNc1nc(Nc2ccc(cc2)N2CCOCC2)nc2nc[nH]c12