Reaction Details
TargetAdenosine receptor A1
LigandBDBM50170830
Substrate/Competitorn/a
Meas. Tech.ChEMBL_303144 (CHEMBL829118)
Ki 1720±n/a nM
Citation Perreira, MJiang, JKKlutz, AMGao, ZGShainberg, ALu, CThomas, CJJacobson, KA "Reversine" and its 2-substituted adenine derivatives as potent and selective A3 adenosine receptor antagonists. J Med Chem48:4910-8 (2005) 
 
Adenosine receptor A1
Name:Adenosine receptor A1
Type:G Protein-Coupled Receptor (GPCR)
Mol. Mass.:36520.92
Organism:Homo sapiens (Human)
Description:P30542
Residue:326
BDBM50170830
NameBDBM50170830
Synonyms:CHEMBL187458 | N*6*-Cycloheptyl-N*2*-phenyl-9H-purine-2,6-diamine
TypeSmall organic molecule
Emp. Form.C18H22N6
Mol. Mass.322.4075
SMILESC1CCCC(CC1)Nc1nc(Nc2ccccc2)nc2nc[nH]c12