Reaction Details
TargetAdenosine receptor A3
LigandBDBM50170822
Substrate/Competitorn/a
Meas. Tech.ChEMBL_303319 (CHEMBL840044)
Ki 51±n/a nM
Citation Perreira, MJiang, JKKlutz, AMGao, ZGShainberg, ALu, CThomas, CJJacobson, KA "Reversine" and its 2-substituted adenine derivatives as potent and selective A3 adenosine receptor antagonists. J Med Chem48:4910-8 (2005) 
 
Adenosine receptor A3
Name:Adenosine receptor A3
Type:G Protein-Coupled Receptor (GPCR)
Mol. Mass.:36197.32
Organism:Homo sapiens (Human)
Description:P0DMS8
Residue:318
BDBM50170822
NameBDBM50170822
Synonyms:CHEMBL188592 | N*6*-Cyclohexyl-N*2*-phenyl-9H-purine-2,6-diamine
TypeSmall organic molecule
Emp. Form.C17H20N6
Mol. Mass.308.3809
SMILESC1CCC(CC1)Nc1nc(Nc2ccccc2)nc2nc[nH]c12