Reaction Details
TargetLysophosphatidic acid receptor 1
LigandBDBM50170861
Substrate/Competitorn/a
Meas. Tech.ChEMBL_303205 (CHEMBL829831)
Ki 788±n/a nM
Citation Durgam, GGVirag, TWalker, MDTsukahara, RYasuda, SLiliom, Kvan Meeteren, LAMoolenaar, WHWilke, NSiess, WTigyi, GMiller, DD Synthesis, structure-activity relationships, and biological evaluation of fatty alcohol phosphates as lysophosphatidic acid receptor ligands, activators of PPARgamma, and inhibitors of autotaxin. J Med Chem48:4919-30 (2005) 
 
Lysophosphatidic acid receptor 1
Name:Lysophosphatidic acid receptor 1
Type:Enzyme
Mol. Mass.:41120.55
Organism:Homo sapiens (Human)
Description:Q92633
Residue:364
BDBM50170861
NameBDBM50170861
Synonyms:(1,1-Difluoro-pentadecyl)-phosphonic acid | CHEMBL188859
TypeSmall organic molecule
Emp. Form.C15H31F2O3P
Mol. Mass.328.3754
(F)(F)P(O)(O)=O