Reaction Details
TargetLysophosphatidic acid receptor 3
LigandBDBM50170862
Substrate/Competitorn/a
Meas. Tech.ChEMBL_303206 (CHEMBL829832)
Ki 202±n/a nM
Citation Durgam, GGVirag, TWalker, MDTsukahara, RYasuda, SLiliom, Kvan Meeteren, LAMoolenaar, WHWilke, NSiess, WTigyi, GMiller, DD Synthesis, structure-activity relationships, and biological evaluation of fatty alcohol phosphates as lysophosphatidic acid receptor ligands, activators of PPARgamma, and inhibitors of autotaxin. J Med Chem48:4919-30 (2005) 
 
Lysophosphatidic acid receptor 3
Name:Lysophosphatidic acid receptor 3
Type:Enzyme
Mol. Mass.:40149.72
Organism:Homo sapiens (Human)
Description:Q9UBY5
Residue:353
BDBM50170862
NameBDBM50170862
Synonyms:CHEMBL191055 | Octanoic acid (S)-1-methyl-2-octanoyloxy-diphosphoric acid
TypeSmall organic molecule
Emp. Form.C19H38O11P2
Mol. Mass.504.4459
SMILESCCCCCCCC(=O)OC[C@H](COP(O)(=O)OP(O)(O)=O)OC(=O)CCCCCCC