Reaction Details
TargetLysophosphatidic acid receptor 3
LigandBDBM50170851
Substrate/Competitorn/a
Meas. Tech.ChEMBL_303206 (CHEMBL829832)
Ki 40±n/a nM
Citation Durgam, GGVirag, TWalker, MDTsukahara, RYasuda, SLiliom, Kvan Meeteren, LAMoolenaar, WHWilke, NSiess, WTigyi, GMiller, DD Synthesis, structure-activity relationships, and biological evaluation of fatty alcohol phosphates as lysophosphatidic acid receptor ligands, activators of PPARgamma, and inhibitors of autotaxin. J Med Chem48:4919-30 (2005) 
 
Lysophosphatidic acid receptor 3
Name:Lysophosphatidic acid receptor 3
Type:Enzyme
Mol. Mass.:40149.72
Organism:Homo sapiens (Human)
Description:Q9UBY5
Residue:353
BDBM50170851
NameBDBM50170851
Synonyms:CHEMBL188591 | Phosphoric acid mono-((E)-tetradec-11-enyl) ester
TypeSmall organic molecule
Emp. Form.C14H29O4P
Mol. Mass.292.3514
SMILESCC\C=C\CCCCCCCCCCOP(O)(O)=O