Reaction Details
TargetLysophosphatidic acid receptor 2
LigandBDBM50170846
Substrate/Competitorn/a
Meas. Tech.ChEMBL_303184 (CHEMBL829678)
Ki 3550±n/a nM
Citation Durgam, GGVirag, TWalker, MDTsukahara, RYasuda, SLiliom, Kvan Meeteren, LAMoolenaar, WHWilke, NSiess, WTigyi, GMiller, DD Synthesis, structure-activity relationships, and biological evaluation of fatty alcohol phosphates as lysophosphatidic acid receptor ligands, activators of PPARgamma, and inhibitors of autotaxin. J Med Chem48:4919-30 (2005) 
 
Lysophosphatidic acid receptor 2
Name:Lysophosphatidic acid receptor 2
Type:PROTEIN
Mol. Mass.:39103.44
Organism:Homo sapiens (Human)
Description:ChEMBL_1451385
Residue:351
BDBM50170846
NameBDBM50170846
Synonyms:CHEMBL190999 | Tetradecyl-phosphonic acid
TypeSmall organic molecule
Emp. Form.C14H31O3P
Mol. Mass.278.3679
(O)(O)=O