Reaction Details
TargetSubstance-K receptor
LigandBDBM50170968
Substrate/Competitorn/a
Meas. Tech.ChEMBL_307257 (CHEMBL829162)
IC50 0.40±n/a nM
Citation Middleton, DSMacKenzie, ARNewman, SDCorless, MWarren, AMarchington, APJones, B Structure-activity relationships of 1-alkyl-5-(3,4-dichlorophenyl)-5-{2-[3-(substituted)-1-azetidinyl]-ethyl}-2-piperidones. Part 2: Improving oral absorption. Bioorg Med Chem Lett15:3957-61 (2005) 
 
Substance-K receptor
Name:Substance-K receptor
Type:Protein
Mol. Mass.:44455.78
Organism:Homo sapiens (Human)
Description:P21452
Residue:398
BDBM50170968
NameBDBM50170968
Synonyms:(S)-5-(3,4-Dichloro-phenyl)-1-(4,4-difluoro-cyclohexylmethyl)-5-{2-[3-(4-fluoro-piperidin-1-yl)-azetidin-1-yl]-ethyl}-piperidin-2-one | CHEMBL182600
TypeSmall organic molecule
Emp. Form.C28H38Cl2F3N3O
Mol. Mass.560.522
SMILESFC1CCN(CC1)C1CN(CC[C@@]2(CCC(=O)N(CC3CCC(F)(F)CC3)C2)c2ccc(Cl)c(Cl)c2)C1