Reaction Details
TargetMetabotropic glutamate receptor 5
LigandBDBM50171073
Substrate/Competitorn/a
Meas. Tech.ChEMBL_322430 (CHEMBL873552)
IC50 46±n/a nM
Citation Kamenecka, TMBonnefous, CGovek, SVernier, JMHutchinson, JChung, JReyes-Manalo, GAnderson, JJ Dipyridyl amines: potent metabotropic glutamate subtype 5 receptor antagonists. Bioorg Med Chem Lett15:4350-3 (2005) 
 
Metabotropic glutamate receptor 5
Name:Metabotropic glutamate receptor 5
Type:Enzyme
Mol. Mass.:132484.72
Organism:Homo sapiens (Human)
Description:n/a
Residue:1212
BDBM50171073
NameBDBM50171073
Synonyms:5-Ethoxy-6-(6-methyl-pyridin-2-ylamino)-nicotinonitrile | CHEMBL198093
TypeSmall organic molecule
Emp. Form.C14H14N4O
Mol. Mass.254.2872
SMILESCCOc1cc(cnc1Nc1cccc(C)n1)C#N