Reaction Details
TargetMetabotropic glutamate receptor 5
LigandBDBM50171075
Substrate/Competitorn/a
Meas. Tech.ChEMBL_322430 (CHEMBL873552)
IC50 17±n/a nM
Citation Kamenecka, TMBonnefous, CGovek, SVernier, JMHutchinson, JChung, JReyes-Manalo, GAnderson, JJ Dipyridyl amines: potent metabotropic glutamate subtype 5 receptor antagonists. Bioorg Med Chem Lett15:4350-3 (2005) 
 
Metabotropic glutamate receptor 5
Name:Metabotropic glutamate receptor 5
Type:Enzyme
Mol. Mass.:132484.72
Organism:Homo sapiens (Human)
Description:n/a
Residue:1212
BDBM50171075
NameBDBM50171075
Synonyms:(5-Chloro-3-ethoxy-pyridin-2-yl)-(6-methyl-pyridin-2-yl)-amine | CHEMBL198715
TypeSmall organic molecule
Emp. Form.C13H14ClN3O
Mol. Mass.263.723
SMILESCCOc1cc(Cl)cnc1Nc1cccc(C)n1