Reaction Details
TargetKappa-type opioid receptor
LigandBDBM50171166
Substrate/Competitorn/a
Meas. Tech.ChEMBL_320955 (CHEMBL885362)
Ki 29±n/a nM
Citation Lee, DYHe, MKondaveti, LLiu-Chen, LYMa, ZWang, YChen, YLi, JGBeguin, CCarlezon, WACohen, B Synthesis and in vitro pharmacological studies of C(4) modified salvinorin A analogues. Bioorg Med Chem Lett15:4169-73 (2005) 
 
Kappa-type opioid receptor
Name:Kappa-type opioid receptor
Type:G Protein-Coupled Receptor (GPCR)
Mol. Mass.:42648.76
Organism:Homo sapiens (Human)
Description:P41145
Residue:380
BDBM50171166
NameBDBM50171166
Synonyms:(3S,4aR,4bS,6S,8R,8aR,10aR)-6-Acetoxy-3-furan-3-yl-4a,8a-dimethyl-1,5-dioxo-dodecahydro-2-oxa-phenanthrene-8-carboxylic acid ethyl ester | CHEMBL362953
TypeSmall organic molecule
Emp. Form.C24H30O8
Mol. Mass.446.4902
SMILESCCOC(=O)[C@@H]1C[C@H](OC(C)=O)C(=O)[C@H]2[C@@]1(C)CC[C@H]1C(=O)O[C@@H](C[C@]21C)c1ccoc1