Reaction Details
Target5-hydroxytryptamine receptor 2C
LigandBDBM50171262
Substrate/Competitorn/a
Meas. Tech.ChEMBL_320988 (CHEMBL872135)
Ki 4.4±n/a nM
Citation Sard, HKumaran, GMorency, CRoth, BLToth, BAHe, PShuster, L SAR of psilocybin analogs: discovery of a selective 5-HT 2C agonist. Bioorg Med Chem Lett15:4555-9 (2005) 
 
5-hydroxytryptamine receptor 2C
Name:5-hydroxytryptamine receptor 2C
Type:G Protein-Coupled Receptor (GPCR)
Mol. Mass.:51836.79
Organism:Homo sapiens (Human)
Description:P28335
Residue:458
BDBM50171262
NameBDBM50171262
Synonyms:1-Butyl-3-(2-dimethylamino-ethyl)-1H-indol-4-ol | CHEMBL198124
TypeSmall organic molecule
Emp. Form.C16H24N2O
Mol. Mass.260.3746
SMILESCCCCn1cc(CCN(C)C)c2c(O)cccc12