Reaction Details
Target5-hydroxytryptamine receptor 2C
LigandBDBM50171261
Substrate/Competitorn/a
Meas. Tech.ChEMBL_320988 (CHEMBL872135)
Ki 7±n/a nM
Citation Sard, HKumaran, GMorency, CRoth, BLToth, BAHe, PShuster, L SAR of psilocybin analogs: discovery of a selective 5-HT 2C agonist. Bioorg Med Chem Lett15:4555-9 (2005) 
 
5-hydroxytryptamine receptor 2C
Name:5-hydroxytryptamine receptor 2C
Type:G Protein-Coupled Receptor (GPCR)
Mol. Mass.:51836.79
Organism:Homo sapiens (Human)
Description:P28335
Residue:458
BDBM50171261
NameBDBM50171261
Synonyms:3-(2-Dimethylamino-ethyl)-1-methyl-1H-indol-4-ol | CHEMBL197664
TypeSmall organic molecule
Emp. Form.C13H18N2O
Mol. Mass.218.2948
SMILESCN(C)CCc1cn(C)c2cccc(O)c12