Reaction Details
TargetProstacyclin receptor
LigandBDBM50171474
Substrate/Competitorn/a
Meas. Tech.ChEMBL_303625 (CHEMBL828836)
Ki 210±n/a nM
Citation Ohno, MMiyamoto, MHoshi, KTakeda, TYamada, NOhtake, A Development of dual-acting benzofurans for thromboxane A2 receptor antagonist and prostacyclin receptor agonist: synthesis, structure-activity relationship, and evaluation of benzofuran derivatives. J Med Chem48:5279-94 (2005) 
 
Prostacyclin receptor
Name:Prostacyclin receptor
Type:G Protein-Coupled Receptor (GPCR)
Mol. Mass.:40968.22
Organism:Homo sapiens (Human)
Description:The membranes prepared from human platelet were used in binding assay.
Residue:386
BDBM50171474
NameBDBM50171474
Synonyms:CHEMBL192662 | [3-[2-(1,1-Diphenyl-ethylsulfanyl)-ethyl]-2-(2-hydroxy-ethyl)-benzofuran-7-yloxy]-acetic acid
TypeSmall organic molecule
Emp. Form.C28H28O5S
Mol. Mass.476.584
SMILESCC(SCCc1c(CCO)oc2c(OCC(O)=O)cccc12)(c1ccccc1)c1ccccc1