Reaction Details
TargetThromboxane A2 receptor
LigandBDBM50171480
Substrate/Competitorn/a
Meas. Tech.ChEMBL_303672 (CHEMBL830433)
Ki 150±n/a nM
Citation Ohno, MMiyamoto, MHoshi, KTakeda, TYamada, NOhtake, A Development of dual-acting benzofurans for thromboxane A2 receptor antagonist and prostacyclin receptor agonist: synthesis, structure-activity relationship, and evaluation of benzofuran derivatives. J Med Chem48:5279-94 (2005) 
 
Thromboxane A2 receptor
Name:Thromboxane A2 receptor
Type:Enyzme
Mol. Mass.:37445.28
Organism:Homo sapiens (Human)
Description:P21731
Residue:343
BDBM50171480
NameBDBM50171480
Synonyms:CHEMBL191118 | {2-Hydroxymethyl-3-[2-(2,2,2-trifluoro-1,1-diphenyl-ethylsulfanyl)-ethyl]-benzofuran-7-yloxy}-acetic acid
TypeSmall organic molecule
Emp. Form.C27H23F3O5S
Mol. Mass.516.529
SMILESOCc1oc2c(OCC(O)=O)cccc2c1CCSC(c1ccccc1)(c1ccccc1)C(F)(F)F