Reaction Details
TargetProstacyclin receptor
LigandBDBM50171483
Substrate/Competitorn/a
Meas. Tech.ChEMBL_303625 (CHEMBL828836)
Ki>10000±n/a nM
Citation Ohno, MMiyamoto, MHoshi, KTakeda, TYamada, NOhtake, A Development of dual-acting benzofurans for thromboxane A2 receptor antagonist and prostacyclin receptor agonist: synthesis, structure-activity relationship, and evaluation of benzofuran derivatives. J Med Chem48:5279-94 (2005) 
 
Prostacyclin receptor
Name:Prostacyclin receptor
Type:G Protein-Coupled Receptor (GPCR)
Mol. Mass.:40968.22
Organism:Homo sapiens (Human)
Description:The membranes prepared from human platelet were used in binding assay.
Residue:386
BDBM50171483
NameBDBM50171483
Synonyms:CHEMBL365501 | {3-[2-(Diphenyl-ethanesulfinyl)-ethyl]-2-hydroxymethyl-benzofuran-7-yloxy}-acetic acid
TypeSmall organic molecule
Emp. Form.C27H26O6S
Mol. Mass.478.557
SMILESCC(c1ccccc1)(c1ccccc1)S(=O)CCc1c(CO)oc2c(OCC(O)=O)cccc12