Reaction Details
TargetProstacyclin receptor
LigandBDBM50171473
Substrate/Competitorn/a
Meas. Tech.ChEMBL_303625 (CHEMBL828836)
Ki 270±n/a nM
Citation Ohno, MMiyamoto, MHoshi, KTakeda, TYamada, NOhtake, A Development of dual-acting benzofurans for thromboxane A2 receptor antagonist and prostacyclin receptor agonist: synthesis, structure-activity relationship, and evaluation of benzofuran derivatives. J Med Chem48:5279-94 (2005) 
 
Prostacyclin receptor
Name:Prostacyclin receptor
Type:G Protein-Coupled Receptor (GPCR)
Mol. Mass.:40968.22
Organism:Homo sapiens (Human)
Description:The membranes prepared from human platelet were used in binding assay.
Residue:386
BDBM50171473
NameBDBM50171473
Synonyms:CHEMBL187758 | [3-(3-Benzhydrylsulfanyl-propyl)-benzofuran-7-yloxy]-acetic acid
TypeSmall organic molecule
Emp. Form.C26H24O4S
Mol. Mass.432.531
SMILESOC(=O)COc1cccc2c(CCCSC(c3ccccc3)c3ccccc3)coc12