Reaction Details
TargetThromboxane A2 receptor
LigandBDBM50171470
Substrate/Competitorn/a
Meas. Tech.ChEMBL_303672 (CHEMBL830433)
Ki>5900±n/a nM
Citation Ohno, MMiyamoto, MHoshi, KTakeda, TYamada, NOhtake, A Development of dual-acting benzofurans for thromboxane A2 receptor antagonist and prostacyclin receptor agonist: synthesis, structure-activity relationship, and evaluation of benzofuran derivatives. J Med Chem48:5279-94 (2005) 
 
Thromboxane A2 receptor
Name:Thromboxane A2 receptor
Type:Enyzme
Mol. Mass.:37445.28
Organism:Homo sapiens (Human)
Description:P21731
Residue:343
BDBM50171470
NameBDBM50171470
Synonyms:CHEMBL191162 | {3-[2-(1,1-Diphenyl-butylsulfanyl)-ethyl]-2-hydroxymethyl-benzofuran-7-yloxy}-acetic acid
TypeSmall organic molecule
Emp. Form.C29H30O5S
Mol. Mass.490.611
SMILESCCCC(SCCc1c(CO)oc2c(OCC(O)=O)cccc12)(c1ccccc1)c1ccccc1