Reaction Details
TargetProstacyclin receptor
LigandBDBM50171482
Substrate/Competitorn/a
Meas. Tech.ChEMBL_303625 (CHEMBL828836)
Ki 560.0±n/a nM
Citation Ohno, MMiyamoto, MHoshi, KTakeda, TYamada, NOhtake, A Development of dual-acting benzofurans for thromboxane A2 receptor antagonist and prostacyclin receptor agonist: synthesis, structure-activity relationship, and evaluation of benzofuran derivatives. J Med Chem48:5279-94 (2005) 
 
Prostacyclin receptor
Name:Prostacyclin receptor
Type:G Protein-Coupled Receptor (GPCR)
Mol. Mass.:40968.22
Organism:Homo sapiens (Human)
Description:The membranes prepared from human platelet were used in binding assay.
Residue:386
BDBM50171482
NameBDBM50171482
Synonyms:CHEMBL190735 | {3-[2-(3,3-Diphenyl-propylsulfanyl)-ethyl]-benzofuran-7-yloxy}-acetic acid
TypeSmall organic molecule
Emp. Form.C27H26O4S
Mol. Mass.446.558
SMILESOC(=O)COc1cccc2c(CCSCCC(c3ccccc3)c3ccccc3)coc12