Reaction Details
TargetThromboxane A2 receptor
LigandBDBM50171471
Substrate/Competitorn/a
Meas. Tech.ChEMBL_303672 (CHEMBL830433)
Ki 3100±n/a nM
Citation Ohno, MMiyamoto, MHoshi, KTakeda, TYamada, NOhtake, A Development of dual-acting benzofurans for thromboxane A2 receptor antagonist and prostacyclin receptor agonist: synthesis, structure-activity relationship, and evaluation of benzofuran derivatives. J Med Chem48:5279-94 (2005) 
 
Thromboxane A2 receptor
Name:Thromboxane A2 receptor
Type:Enyzme
Mol. Mass.:37445.28
Organism:Homo sapiens (Human)
Description:P21731
Residue:343
BDBM50171471
NameBDBM50171471
Synonyms:CHEMBL189063 | [3-(3,3-Diphenyl-propylsulfanylmethyl)-benzofuran-7-yloxy]-acetic acid
TypeSmall organic molecule
Emp. Form.C26H24O4S
Mol. Mass.432.531
SMILESOC(=O)COc1cccc2c(CSCCC(c3ccccc3)c3ccccc3)coc12