Reaction Details
TargetEpidermal growth factor receptor
LigandBDBM4583
Substrate/Competitorn/a
Meas. Tech.ChEMBL_305171 (CHEMBL832761)
IC50 0.41±n/a nM
Citation Mishani, EAbourbeh, GJacobson, ODissoki, SBen Daniel, RRozen, YShaul, MLevitzki, A High-affinity epidermal growth factor receptor (EGFR) irreversible inhibitors with diminished chemical reactivities as positron emission tomography (PET)-imaging agent candidates of EGFR overexpressing tumors. J Med Chem48:5337-48 (2005) 
 
Epidermal growth factor receptor
Name:Epidermal growth factor receptor
Type:Receptor Kinase Domain
Mol. Mass.:134279.59
Organism:Homo sapiens (Human)
Description:P00533
Residue:1210
BDBM4583
NameBDBM4583
Synonyms:(2E)-N-{4-[(3-bromophenyl)amino]quinazolin-6-yl}-4-(dimethylamino)but-2-enamide BMC163482 Compound 2 | CHEMBL94061
TypeSmall organic molecule
Emp. Form.C20H20BrN5O
Mol. Mass.426.31
SMILESCN(C)C\C=C\C(=O)Nc1ccc2ncnc(Nc3cccc(Br)c3)c2c1