Reaction Details
TargetSphingosine 1-phosphate receptor 3
LigandBDBM23163
Substrate/Competitorn/a
Meas. Tech.ChEMBL_304343 (CHEMBL839769)
pH7.4±n/a
EC50 1.4±n/a nM
Commentsextracted
Citation Albert, RHinterding, KBrinkmann, VGuerini, DMüller-Hartwieg, CKnecht, HSimeon, CStreiff, MWagner, TWelzenbach, KZécri, FZollinger, MCooke, NFrancotte, E Novel immunomodulator FTY720 is phosphorylated in rats and humans to form a single stereoisomer. Identification, chemical proof, and biological characterization of the biologically active species and its enantiomer. J Med Chem48:5373-7 (2005) 
 
Sphingosine 1-phosphate receptor 3
Name:Sphingosine 1-phosphate receptor 3
Type:G Protein-Coupled Receptor (GPCR)
Mol. Mass.:42278.13
Organism:Homo sapiens (Human)
Description:Q99500
Residue:378
BDBM23163
NameBDBM23163
Synonyms:CHEMBL114606 {2-amino-3-hydroxy-2-[2-(4-octylphenyl)ethyl]propoxy}phosphonic acid
TypeSmall organic molecule
Emp. Form.C19H34NO5P
Mol. Mass.387.4507
SMILESCCCCCCCCc1ccc(CCC(N)(CO)COP(O)(O)=O)cc1