Reaction Details
TargetMelanin-concentrating hormone receptor 1
LigandBDBM50171597
Substrate/Competitorn/a
Meas. Tech.ChEMBL_321352 (CHEMBL881496)
IC50 6±n/a nM
Citation Vasudevan, ALaMarche, MJBlackburn, CChe, JLLuchaco-Cullis, CALai, SMarsilje, THPatane, MASouers, AJWodka, DGeddes, BChen, SBrodjian, SFalls, DHDayton, BDBush, EBrune, MShapiro, RDMarsh, KCHernandez, LESham, HLCollins, CAKym, PR Identification of ortho-amino benzamides and nicotinamides as MCHr1 antagonists. Bioorg Med Chem Lett15:4174-9 (2005) 
 
Melanin-concentrating hormone receptor 1
Name:Melanin-concentrating hormone receptor 1
Type:G Protein-Coupled Receptor (GPCR)
Mol. Mass.:45976.27
Organism:Homo sapiens (Human)
Description:Membranes from CHO-K1 cells stably expressing human MCH1R were used in assays.
Residue:422
BDBM50171597
NameBDBM50171597
Synonyms:5-Chloro-N-(1-naphthalen-2-ylmethyl-piperidin-4-yl)-2-[(thiazol-2-ylmethyl)-amino]-benzamide | CHEMBL194726
TypeSmall organic molecule
Emp. Form.C27H27ClN4OS
Mol. Mass.491.047
SMILESClc1ccc(NCc2nccs2)c(c1)C(=O)NC1CCN(Cc2ccc3ccccc3c2)CC1