Reaction Details
Target5-hydroxytryptamine receptor 2A
LigandBDBM50171674
Substrate/Competitorn/a
Meas. Tech.ChEMBL_320904 (CHEMBL872403)
Ki 0.28±n/a nM
Citation Singer, JMBarr, BMCoughenour, LLGregory, TFWalters, MA 8-Substituted 3,4-dihydroquinolinones as a novel scaffold for atypical antipsychotic activity. Bioorg Med Chem Lett15:4560-3 (2005) 
 
5-hydroxytryptamine receptor 2A
Name:5-hydroxytryptamine receptor 2A
Type:undefined
Mol. Mass.:52607.65
Organism:Homo sapiens (Human)
Description:P28223
Residue:471
BDBM50171674
NameBDBM50171674
Synonyms:8-[2-(4-Benzo[d]isoxazol-3-yl-piperazin-1-yl)-ethyl]-6-fluoro-4-methyl-3,4-dihydro-1H-quinolin-2-one | CHEMBL371628
TypeSmall organic molecule
Emp. Form.C23H25FN4O2
Mol. Mass.408.4686
SMILESCC1CC(=O)Nc2c(CCN3CCN(CC3)c3noc4ccccc34)cc(F)cc12