Reaction Details
TargetD(2) dopamine receptor
LigandBDBM50171673
Substrate/Competitorn/a
Meas. Tech.ChEMBL_320893 (CHEMBL872392)
Ki 12±n/a nM
Citation Singer, JMBarr, BMCoughenour, LLGregory, TFWalters, MA 8-Substituted 3,4-dihydroquinolinones as a novel scaffold for atypical antipsychotic activity. Bioorg Med Chem Lett15:4560-3 (2005) 
 
D(2) dopamine receptor
Name:D(2) dopamine receptor
Type:Cell-surface receptors
Mol. Mass.:50647.10
Organism:Homo sapiens (Human)
Description:P14416
Residue:443
BDBM50171673
NameBDBM50171673
Synonyms:1-{8-[2-(4-Benzo[d]isothiazol-3-yl-piperazin-1-yl)-ethyl]-4,5-dimethyl-3,4-dihydro-2H-quinolin-1-yl}-ethanone | CHEMBL197990
TypeSmall organic molecule
Emp. Form.C26H32N4OS
Mol. Mass.448.623
SMILESCC1CCN(C(C)=O)c2c(CCN3CCN(CC3)c3nsc4ccccc34)ccc(C)c12