Reaction Details
Target5-hydroxytryptamine receptor 2A
LigandBDBM50171664
Substrate/Competitorn/a
Meas. Tech.ChEMBL_320904 (CHEMBL872403)
Ki 0.18±n/a nM
Citation Singer, JMBarr, BMCoughenour, LLGregory, TFWalters, MA 8-Substituted 3,4-dihydroquinolinones as a novel scaffold for atypical antipsychotic activity. Bioorg Med Chem Lett15:4560-3 (2005) 
 
5-hydroxytryptamine receptor 2A
Name:5-hydroxytryptamine receptor 2A
Type:undefined
Mol. Mass.:52607.65
Organism:Homo sapiens (Human)
Description:P28223
Residue:471
BDBM50171664
NameBDBM50171664
Synonyms:8-[2-(4-Benzo[d]isothiazol-3-yl-piperazin-1-yl)-ethyl]-4,4-dimethyl-1,2,3,4-tetrahydro-quinoline | CHEMBL194312
TypeSmall organic molecule
Emp. Form.C24H30N4S
Mol. Mass.406.587
SMILESCC1(C)CCNc2c(CCN3CCN(CC3)c3nsc4ccccc34)cccc12