Reaction Details
TargetEstrogen receptor beta
LigandBDBM50171711
Substrate/Competitorn/a
Meas. Tech.ChEMBL_321253 (CHEMBL880931)
IC50 3.4±n/a nM
Citation Vu, ATCohn, STManas, ESHarris, HAMewshaw, RE ERbeta ligands. Part 4: Synthesis and structure-activity relationships of a series of 2-phenylquinoline derivatives. Bioorg Med Chem Lett15:4520-5 (2005) 
 
Estrogen receptor beta
Name:Estrogen receptor beta
Type:Protein
Mol. Mass.:59238.43
Organism:Homo sapiens (Human)
Description:Q92731
Residue:530
BDBM50171711
NameBDBM50171711
Synonyms:4-Bromo-2-(3-fluoro-4-hydroxy-phenyl)-quinolin-6-ol | CHEMBL194265
TypeSmall organic molecule
Emp. Form.C15H9BrFNO2
Mol. Mass.334.14
SMILESOc1ccc2nc(cc(Br)c2c1)-c1ccc(O)c(F)c1