Reaction Details
TargetEstrogen receptor beta
LigandBDBM50171724
Substrate/Competitorn/a
Meas. Tech.ChEMBL_321253 (CHEMBL880931)
IC50 4.3±n/a nM
Citation Vu, ATCohn, STManas, ESHarris, HAMewshaw, RE ERbeta ligands. Part 4: Synthesis and structure-activity relationships of a series of 2-phenylquinoline derivatives. Bioorg Med Chem Lett15:4520-5 (2005) 
 
Estrogen receptor beta
Name:Estrogen receptor beta
Type:Protein
Mol. Mass.:59238.43
Organism:Homo sapiens (Human)
Description:Q92731
Residue:530
BDBM50171724
NameBDBM50171724
Synonyms:4-Bromo-2-(4-hydroxy-phenyl)-quinolin-6-ol CHEMBL198411
TypeSmall organic molecule
Emp. Form.C15H10BrNO2
Mol. Mass.316.149
SMILESOc1ccc(cc1)-c1cc(Br)c2cc(O)ccc2n1