Reaction Details
TargetThyroid hormone receptor beta
LigandBDBM50171802
Substrate/Competitorn/a
Meas. Tech.ChEMBL_321321 (CHEMBL882591)
IC50 0.3±n/a nM
Citation Hangeland, JJFriends, TJDoweyko, AMMellström, KSandberg, JGrynfarb, MRyono, DE A new class of high affinity thyromimetics containing a phenyl-naphthylene core. Bioorg Med Chem Lett15:4579-84 (2005) 
 
Thyroid hormone receptor beta
Name:Thyroid hormone receptor beta
Type:Receptor
Mol. Mass.:52793.62
Organism:Homo sapiens (Human)
Description:Recombinant hThR was obtained from nuclear extracts from SF9 cells infected with baculovirus vectors encoding for ThRbeta 1.
Residue:461
BDBM50171802
NameBDBM50171802
Synonyms:CHEMBL196642 | N-[3,5-Dichloro-4-(5-isopropyl-6-methoxy-naphthalen-1-yl)-phenyl]-malonamic acid
TypeSmall organic molecule
Emp. Form.C23H21Cl2NO4
Mol. Mass.446.323
SMILESCOc1ccc2c(cccc2c1C(C)C)-c1c(Cl)cc(NC(=O)CC(O)=O)cc1Cl