Reaction Details
TargetPeroxisome proliferator-activated receptor alpha
LigandBDBM28699
Substrate/Competitorn/a
Meas. Tech.ChEMBL_304361 (CHEMBL839790)
EC50 39600±n/a nM
Citation Pinelli, AGodio, CLaghezza, AMitro, NFracchiolla, GTortorella, VLavecchia, ANovellino, EFruchart, JCStaels, BCrestani, MLoiodice, F Synthesis, biological evaluation, and molecular modeling investigation of new chiral fibrates with PPARalpha and PPARgamma agonist activity. J Med Chem48:5509-19 (2005) 
 
Peroxisome proliferator-activated receptor alpha
Name:Peroxisome proliferator-activated receptor alpha
Type:Enzyme
Mol. Mass.:52222.08
Organism:Homo sapiens (Human)
Description:Q07869
Residue:468
BDBM28699
NameBDBM28699
Synonyms:2-(4-chlorophenoxy)-2-methylpropanoic acid Clofibrate clofibric acid
TypeSmall organic molecule
Emp. Form.C10H11ClO3
Mol. Mass.214.646
SMILESCC(C)(Oc1ccc(Cl)cc1)C(O)=O