Reaction Details
TargetAldo-keto reductase family 1 member B1
LigandBDBM16312
Substrate/Competitorn/a
Meas. Tech.ChEMBL_305465 (CHEMBL831075)
IC50 900±n/a nM
Citation El-Kabbani, OCarbone, VDarmanin, COka, MMitschler, APodjarny, ASchulze-Briese, CChung, RP Structure of aldehyde reductase holoenzyme in complex with the potent aldose reductase inhibitor fidarestat: implications for inhibitor binding and selectivity. J Med Chem48:5536-42 (2005) 
 
Aldo-keto reductase family 1 member B1
Name:Aldo-keto reductase family 1 member B1
Type:PROTEIN
Mol. Mass.:35797.87
Organism:Rattus norvegicus
Description:ChEMBL_1512484
Residue:316
BDBM16312
NameBDBM16312
Synonyms:(4S)-6-fluoro-2,3-dihydrospiro[1-benzopyran-4,4'-imidazolidine]-2',5'-dione Sorbinil
TypeSmall organic molecule
Emp. Form.C11H9FN2O3
Mol. Mass.236.1992
SMILESFc1ccc2OCC[C@]3(NC(=O)NC3=O)c2c1