Reaction Details
TargetLiver carboxylesterase 1
LigandBDBM50171926
Substrate/Competitorn/a
Meas. Tech.ChEMBL_303802 (CHEMBL829851)
Ki 126±n/a nM
Citation Hyatt, JLStacy, VWadkins, RMYoon, KJWierdl, MEdwards, CCZeller, MHunter, ADDanks, MKCrundwell, GPotter, PM Inhibition of carboxylesterases by benzil (diphenylethane-1,2-dione) and heterocyclic analogues is dependent upon the aromaticity of the ring and the flexibility of the dione moiety. J Med Chem48:5543-50 (2005) 
 
Liver carboxylesterase 1
Name:Liver carboxylesterase 1
Type:Protein
Mol. Mass.:62520.83
Organism:Homo sapiens (Human)
Description:n/a
Residue:567
BDBM50171926
NameBDBM50171926
Synonyms:1,2-Di-pyridin-2-yl-ethane-1,2-dione 1,2-diketone, 2,2'-pyridil | CHEMBL373345
TypeSmall organic molecule
Emp. Form.C12H8N2O2
Mol. Mass.212.2041
SMILESO=C(C(=O)c1ccccn1)c1ccccn1