Reaction Details
TargetAcetylcholinesterase
LigandBDBM22722
Substrate/Competitorn/a
Meas. Tech.ChEMBL_303485 (CHEMBL838859)
Ki>100000±n/a nM
Citation Hyatt, JLStacy, VWadkins, RMYoon, KJWierdl, MEdwards, CCZeller, MHunter, ADDanks, MKCrundwell, GPotter, PM Inhibition of carboxylesterases by benzil (diphenylethane-1,2-dione) and heterocyclic analogues is dependent upon the aromaticity of the ring and the flexibility of the dione moiety. J Med Chem48:5543-50 (2005) 
 
Acetylcholinesterase
Name:Acetylcholinesterase
Type:Enzyme
Mol. Mass.:67792.70
Organism:Homo sapiens (Human)
Description:P22303
Residue:614
BDBM22722
NameBDBM22722
Synonyms:1,2-diphenylethane-1,2-dione CHEMBL189886 | Diphenylethane-1,2-dione
TypeSmall organic molecule
Emp. Form.C14H10O2
Mol. Mass.210.228
SMILESO=C(C(=O)c1ccccc1)c1ccccc1