Reaction Details
TargetAcetylcholinesterase
LigandBDBM50171928
Substrate/Competitorn/a
Meas. Tech.ChEMBL_303485 (CHEMBL838859)
Ki>100000±n/a nM
Citation Hyatt, JLStacy, VWadkins, RMYoon, KJWierdl, MEdwards, CCZeller, MHunter, ADDanks, MKCrundwell, GPotter, PM Inhibition of carboxylesterases by benzil (diphenylethane-1,2-dione) and heterocyclic analogues is dependent upon the aromaticity of the ring and the flexibility of the dione moiety. J Med Chem48:5543-50 (2005) 
 
Acetylcholinesterase
Name:Acetylcholinesterase
Type:Enzyme
Mol. Mass.:67792.70
Organism:Homo sapiens (Human)
Description:P22303
Residue:614
BDBM50171928
NameBDBM50171928
Synonyms:1,2-Bis-(5-bromo-thiophen-2-yl)-ethane-1,2-dione CHEMBL192592
TypeSmall organic molecule
Emp. Form.C10H4Br2O2S2
Mol. Mass.380.076
SMILESBrc1ccc(s1)C(=O)C(=O)c1ccc(Br)s1