Reaction Details
TargetCocaine esterase
LigandBDBM50171927
Substrate/Competitorn/a
Meas. Tech.ChEMBL_303811 (CHEMBL827070)
Ki 8000±n/a nM
Citation Hyatt, JLStacy, VWadkins, RMYoon, KJWierdl, MEdwards, CCZeller, MHunter, ADDanks, MKCrundwell, GPotter, PM Inhibition of carboxylesterases by benzil (diphenylethane-1,2-dione) and heterocyclic analogues is dependent upon the aromaticity of the ring and the flexibility of the dione moiety. J Med Chem48:5543-50 (2005) 
 
Cocaine esterase
Name:Cocaine esterase
Type:PROTEIN
Mol. Mass.:61801.08
Organism:Homo sapiens (Human)
Description:ChEMBL_1494240
Residue:559
BDBM50171927
NameBDBM50171927
Synonyms:1,2-Di-furan-2-yl-ethane-1,2-dione CHEMBL371181
TypeSmall organic molecule
Emp. Form.C10H6O4
Mol. Mass.190.1522
SMILESO=C(C(=O)c1ccco1)c1ccco1