Reaction Details
TargetReverse transcriptase/RNaseH
LigandBDBM50171973
Substrate/Competitorn/a
Meas. Tech.ChEMBL_317566 (CHEMBL825231)
EC50 35±n/a nM
Citation O'Meara, JAYoakim, CBonneau, PRBös, MCordingley, MGDéziel, RDoyon, LDuan, JGarneau, MGuse, ILandry, SMalenfant, ENaud, JOgilvie, WWThavonekham, BSimoneau, B Novel 8-substituted dipyridodiazepinone inhibitors with a broad-spectrum of activity against HIV-1 strains resistant to non-nucleoside reverse transcriptase inhibitors. J Med Chem48:5580-8 (2005) 
 
Reverse transcriptase/RNaseH
Name:Reverse transcriptase/RNaseH
Type:PROTEIN
Mol. Mass.:65229.15
Organism:Human immunodeficiency virus 1
Description:ChEMBL_1473730
Residue:566
BDBM50171973
NameBDBM50171973
Synonyms:3-Bromo-4-[2-(5-ethyl-10-methyl-11-oxo-10,11-dihydro-5H-4,5,6,10-tetraaza-dibenzo[a,d]cyclohepten-2-yl)-ethoxy]-benzoic acid | CHEMBL192790
TypeSmall organic molecule
Emp. Form.C23H21BrN4O4
Mol. Mass.497.341
SMILESCCN1c2ncccc2N(C)C(=O)c2cc(CCOc3ccc(cc3Br)C(O)=O)cnc12