Reaction Details
TargetReverse transcriptase/RNaseH
LigandBDBM50171975
Substrate/Competitorn/a
Meas. Tech.ChEMBL_317596 (CHEMBL825592)
pH7.8±n/a
IC50 200±n/a nM
Commentsextracted
Citation O'Meara, JAYoakim, CBonneau, PRBös, MCordingley, MGDéziel, RDoyon, LDuan, JGarneau, MGuse, ILandry, SMalenfant, ENaud, JOgilvie, WWThavonekham, BSimoneau, B Novel 8-substituted dipyridodiazepinone inhibitors with a broad-spectrum of activity against HIV-1 strains resistant to non-nucleoside reverse transcriptase inhibitors. J Med Chem48:5580-8 (2005) 
 
Reverse transcriptase/RNaseH
Name:Reverse transcriptase/RNaseH
Type:PROTEIN
Mol. Mass.:65229.15
Organism:Human immunodeficiency virus 1
Description:ChEMBL_1473730
Residue:566
BDBM50171975
NameBDBM50171975
Synonyms:3-{4-[2-(5-Ethyl-10-methyl-11-oxo-10,11-dihydro-5H-4,5,6,10-tetraaza-dibenzo[a,d]cyclohepten-2-yl)-ethoxy]-3-methyl-phenyl}-propionic acid | CHEMBL364043
TypeSmall organic molecule
Emp. Form.C26H28N4O4
Mol. Mass.460.5249
SMILESCCN1c2ncccc2N(C)C(=O)c2cc(CCOc3ccc(CCC(O)=O)cc3C)cnc12