Reaction Details
TargetReverse transcriptase/RNaseH
LigandBDBM50171981
Substrate/Competitorn/a
Meas. Tech.ChEMBL_304323 (CHEMBL829295)
EC50 1.3±n/a nM
Citation O'Meara, JAYoakim, CBonneau, PRBös, MCordingley, MGDéziel, RDoyon, LDuan, JGarneau, MGuse, ILandry, SMalenfant, ENaud, JOgilvie, WWThavonekham, BSimoneau, B Novel 8-substituted dipyridodiazepinone inhibitors with a broad-spectrum of activity against HIV-1 strains resistant to non-nucleoside reverse transcriptase inhibitors. J Med Chem48:5580-8 (2005) 
 
Reverse transcriptase/RNaseH
Name:Reverse transcriptase/RNaseH
Type:PROTEIN
Mol. Mass.:65229.15
Organism:Human immunodeficiency virus 1
Description:ChEMBL_1473730
Residue:566
BDBM50171981
NameBDBM50171981
Synonyms:4-[2-(5-Ethyl-7,10-dimethyl-11-oxo-10,11-dihydro-5H-4,5,6,10-tetraaza-dibenzo[a,d]cyclohepten-2-yl)-ethoxy]-3-methyl-benzoic acid | CHEMBL189423
TypeSmall organic molecule
Emp. Form.C25H26N4O4
Mol. Mass.446.4983
SMILESCCN1c2nc(C)ccc2N(C)C(=O)c2cc(CCOc3ccc(cc3C)C(O)=O)cnc12