Reaction Details
TargetReverse transcriptase/RNaseH
LigandBDBM50171976
Substrate/Competitorn/a
Meas. Tech.ChEMBL_317566 (CHEMBL825231)
EC50 14±n/a nM
Citation O'Meara, JAYoakim, CBonneau, PRBös, MCordingley, MGDéziel, RDoyon, LDuan, JGarneau, MGuse, ILandry, SMalenfant, ENaud, JOgilvie, WWThavonekham, BSimoneau, B Novel 8-substituted dipyridodiazepinone inhibitors with a broad-spectrum of activity against HIV-1 strains resistant to non-nucleoside reverse transcriptase inhibitors. J Med Chem48:5580-8 (2005) 
 
Reverse transcriptase/RNaseH
Name:Reverse transcriptase/RNaseH
Type:PROTEIN
Mol. Mass.:65229.15
Organism:Human immunodeficiency virus 1
Description:ChEMBL_1473730
Residue:566
BDBM50171976
NameBDBM50171976
Synonyms:4-[2-(5-Ethyl-7-fluoro-10-methyl-11-oxo-10,11-dihydro-5H-4,5,6,10-tetraaza-dibenzo[a,d]cyclohepten-2-yl)-ethoxy]-3-methyl-benzoic acid | CHEMBL189942
TypeSmall organic molecule
Emp. Form.C24H23FN4O4
Mol. Mass.450.4622
SMILESCCN1c2ncc(CCOc3ccc(cc3C)C(O)=O)cc2C(=O)N(C)c2ccc(F)nc12