Reaction Details
TargetPeroxisome proliferator-activated receptor alpha
LigandBDBM50172004
Substrate/Competitorn/a
Meas. Tech.ChEMBL_310800 (CHEMBL824851)
EC50 2±n/a nM
Citation Shi, GQDropinski, JFZhang, YSantini, CSahoo, SPBerger, JPMacnaul, KLZhou, GAgrawal, AAlvaro, RCai, TQHernandez, MWright, SDMoller, DEHeck, JVMeinke, PT Novel 2,3-dihydrobenzofuran-2-carboxylic acids: highly potent and subtype-selective PPARalpha agonists with potent hypolipidemic activity. J Med Chem48:5589-99 (2005) 
 
Peroxisome proliferator-activated receptor alpha
Name:Peroxisome proliferator-activated receptor alpha
Type:Enzyme
Mol. Mass.:52222.08
Organism:Homo sapiens (Human)
Description:Q07869
Residue:468
BDBM50172004
NameBDBM50172004
Synonyms:(S)-5-{3-[2-Chloro-4-(2,2,2-trifluoro-ethyl)-phenoxy]-propoxy}-2-ethyl-2,3-dihydro-benzofuran-2-carboxylic acid | CHEMBL189110
TypeSmall organic molecule
Emp. Form.C22H22ClF3O5
Mol. Mass.458.855
SMILESCC[C@]1(Cc2cc(OCCCOc3ccc(CC(F)(F)F)cc3Cl)ccc2O1)C(O)=O