Reaction Details
TargetEpidermal growth factor receptor
LigandBDBM13907
Substrate/Competitorn/a
Meas. Tech.ChEMBL_321412 (CHEMBL881943)
IC50 200±n/a nM
Citation Fink, BEVite, GDMastalerz, HKadow, JFKim, SHLeavitt, KJDu, KCrews, DMitt, TWong, TWHunt, JTVyas, DMTokarski, JS New dual inhibitors of EGFR and HER2 protein tyrosine kinases. Bioorg Med Chem Lett15:4774-9 (2005) 
 
Epidermal growth factor receptor
Name:Epidermal growth factor receptor
Type:Receptor Kinase Domain
Mol. Mass.:134279.59
Organism:Homo sapiens (Human)
Description:P00533
Residue:1210
BDBM13907
NameBDBM13907
Synonyms:CHEMBL196738 pyrrolo[2,1-f][1,2,4]triazine analog 5h
TypeSmall organic molecule
Emp. Form.C24H22N6O2
Mol. Mass.426.4705
SMILESCCOC(=O)c1cn2ncnc(Nc3ccc4n(Cc5ccccc5)ncc4c3)c2c1C