Reaction Details
TargetReceptor tyrosine-protein kinase erbB-2
LigandBDBM13912
Substrate/Competitorn/a
Meas. Tech.ChEMBL_321451 (CHEMBL880259)
IC50 110±n/a nM
Citation Fink, BEVite, GDMastalerz, HKadow, JFKim, SHLeavitt, KJDu, KCrews, DMitt, TWong, TWHunt, JTVyas, DMTokarski, JS New dual inhibitors of EGFR and HER2 protein tyrosine kinases. Bioorg Med Chem Lett15:4774-9 (2005) 
 
Receptor tyrosine-protein kinase erbB-2
Name:Receptor tyrosine-protein kinase erbB-2
Type:n/a
Mol. Mass.:137894.47
Organism:Homo sapiens (Human)
Description:P04626
Residue:1255
BDBM13912
NameBDBM13912
Synonyms:4-[(1-benzyl-1H-indazol-5-yl)amino]-5-ethylpyrrolo[1,2-a][1,2,4]triazine-6-carboxamide pyrrolo[2,1-f][1,2,4]triazine analog 7a
TypeSmall organic molecule
Emp. Form.C23H21N7O
Mol. Mass.411.4591
SMILESCCc1c(cn2ncnc(Nc3ccc4n(Cc5ccccc5)ncc4c3)c12)C(N)=O