Reaction Details
TargetReceptor tyrosine-protein kinase erbB-2
LigandBDBM13900
Substrate/Competitorn/a
Meas. Tech.ChEMBL_321451 (CHEMBL880259)
IC50 2800±n/a nM
Citation Fink, BEVite, GDMastalerz, HKadow, JFKim, SHLeavitt, KJDu, KCrews, DMitt, TWong, TWHunt, JTVyas, DMTokarski, JS New dual inhibitors of EGFR and HER2 protein tyrosine kinases. Bioorg Med Chem Lett15:4774-9 (2005) 
 
Receptor tyrosine-protein kinase erbB-2
Name:Receptor tyrosine-protein kinase erbB-2
Type:n/a
Mol. Mass.:137894.47
Organism:Homo sapiens (Human)
Description:P04626
Residue:1255
BDBM13900
NameBDBM13900
Synonyms:CHEMBL196018 pyrrolo[2,1-f][1,2,4]triazine analog 5a
TypeSmall organic molecule
Emp. Form.C17H16ClFN4O2
Mol. Mass.362.786
SMILESCCOC(=O)c1cn2ncnc(Nc3ccc(F)c(Cl)c3)c2c1CC