Reaction Details
TargetReceptor tyrosine-protein kinase erbB-2
LigandBDBM13901
Substrate/Competitorn/a
Meas. Tech.ChEMBL_321451 (CHEMBL880259)
IC50 3000±n/a nM
Citation Fink, BEVite, GDMastalerz, HKadow, JFKim, SHLeavitt, KJDu, KCrews, DMitt, TWong, TWHunt, JTVyas, DMTokarski, JS New dual inhibitors of EGFR and HER2 protein tyrosine kinases. Bioorg Med Chem Lett15:4774-9 (2005) 
 
Receptor tyrosine-protein kinase erbB-2
Name:Receptor tyrosine-protein kinase erbB-2
Type:n/a
Mol. Mass.:137894.47
Organism:Homo sapiens (Human)
Description:P04626
Residue:1255
BDBM13901
NameBDBM13901
Synonyms:CHEMBL370934 pyrrolo[2,1-f][1,2,4]triazine analog 5b
TypeSmall organic molecule
Emp. Form.C17H17BrN4O2
Mol. Mass.389.246
SMILESCCOC(=O)c1cn2ncnc(Nc3cccc(Br)c3)c2c1CC